{"text_format":"1","workbook":"xlsx","n_sheets":6,"sheets":["男子一覧表","女子一覧表","貼り付けデータ","貼り付けデータ２","学校番号","互換性レポート"],"not_rendered":{"charts":0,"images":0,"macros":1,"external_links":0,"defined_names":5,"comments":0,"pivot_tables":0},"unopened":[],"bounds":{"document_bytes":16777216,"sheet_cells":100000,"rows_first":2000,"rows_last":500,"rows_between":2000,"halvings":0,"cell_chars":16384,"cell_head_chars":4096},"cells_cut":0,"cells_raw":0,"read":"whole","date_system":"1900"}

{"sheet":"男子一覧表","index":0,"n_rows":56,"n_cols":35,"rows_kept":56,"cut":false,"hidden":false,"merged":[[40,14,40,19],[3,11,3,17],[38,11,38,13],[38,14,38,17],[39,14,39,17],[37,14,37,19],[41,0,41,2],[36,0,36,2],[37,0,37,2],[38,0,38,2],[39,0,39,2],[40,0,40,2],[0,0,0,17],[45,17,45,19],[42,14,42,17],[42,11,42,13],[41,14,41,19],[3,5,4,5],[39,11,39,13],[41,11,41,13],[37,11,37,13],[1,13,1,16],[3,0,4,0],[3,3,4,3],[44,14,44,16],[40,11,40,13],[3,4,4,4],[3,1,4,1]]}
["第５９回　三鷹市陸上競技選手権大会　兼　第４８回三鷹市陸上競技記録会"]
["（様式１）",null,"記録証希望の方、参加種目、セルの背景を黄色にしてください。",null,null,null,null,null,null,null,null,null,null,"高校　男子　申し込み用"]
[null,null,null,null,null,null,null,null,null,null,null,null,null,null,null,null,"三鷹市陸上競技会"]
["No．","登録　　陸協名","選手","氏　　　名","フリガナ\n（要確認修正）","学年",null,null,null,null,null,"申　込　種　目",null,null,null,null,null,null,null,null,null,null,null,"←押さないでください。"]
[null,null,"番号",null,null,null,"支部コード","所属","学校コード","地域","性","個人種目","種目コード","最高記録","個人種目","種目コード","最高記録","リレー","種目コード"]
[1,null,null,null,{"$f":"PHONETIC(D6)","v":""},null,null,{"$f":"$O$38","v":0},null,null,"男",null,null,null,null,null,null,null,{"$f":"IF(R6=\"\",\"\",VLOOKUP(R6,$AE$24:$AF$29,2,FALSE))","v":""},{"$f":"IF(R6=\"低学年\",IF($O$3=\"\",\"\",$O$3),IF(R6=\"共通\",IF(#REF!=\"\",\"\",#REF!),\"\"))","v":""},null,null,null,null,null,null,null,null,null,null,"種目","種目コード",null,null,{"$f":"IF(AND(L6=\"\",O6=\"\"),0,1)","v":0}]
[2,null,null,null,"",null,null,0,null,null,"男",null,null,null,null,null,null,null,"",{"$f":"IF(R7=\"低学年\",IF($O$3=\"\",\"\",$O$3),IF(R7=\"共通\",IF(#REF!=\"\",\"\",#REF!),\"\"))","v":""},null,"重要","ファイル名を変えずに",null,null,null,"都道府県","種目コード",null,{"$f":"RAND()","v":0.30938226706461958},"100m",201,null,null,0]
[3,null,null,null,"",null,null,0,null,null,"男",null,null,null,null,null,null,null,"",{"$f":"IF(R8=\"低学年\",IF($O$3=\"\",\"\",$O$3),IF(R8=\"共通\",IF(#REF!=\"\",\"\",#REF!),\"\"))","v":""},null,null,"保存してください。",null,null,null,"東京",201,null,0.7208802099143603,"200m",202,null,null,0]
[4,null,null,null,"",null,null,0,null,null,"男",null,null,null,null,null,null,null,"",{"$f":"IF(R9=\"低学年\",IF($O$3=\"\",\"\",$O$3),IF(R9=\"共通\",IF(#REF!=\"\",\"\",#REF!),\"\"))","v":""},null,null,"選手番号は記入しないでください。",null,null,null,"埼玉",202,null,0.6300692381515629,"400m",203,null,null,0]
[5,null,null,null,"",null,null,0,null,null,"男",null,null,null,null,null,null,null,"",{"$f":"IF(R10=\"低学年\",IF($O$3=\"\",\"\",$O$3),IF(R10=\"共通\",IF(#REF!=\"\",\"\",#REF!),\"\"))","v":""},null,"手順",null,null,null,null,"神奈川",203,null,0.36342472959504402,"800m",300,null,null,0]
[6,null,null,null,"",null,null,0,null,null,"男",null,null,null,null,null,null,null,"",{"$f":"IF(R11=\"低学年\",IF($O$3=\"\",\"\",$O$3),IF(R11=\"共通\",IF(#REF!=\"\",\"\",#REF!),\"\"))","v":""},null,"①","選手のデータを入力してください。",null,null,null,"千葉",300,null,0.39681700616289362,"1500m",500,null,null,0]
[7,null,null,null,"",null,null,0,null,null,"男",null,null,null,null,null,null,null,"",{"$f":"IF(R12=\"低学年\",IF($O$3=\"\",\"\",$O$3),IF(R12=\"共通\",IF(#REF!=\"\",\"\",#REF!),\"\"))","v":""},null,"②","リレーのデータを入力してください。",null,null,null,"茨城",600,null,0.38634901458141058,"5000m",600,null,null,0]
[8,null,null,null,"",null,null,0,null,null,"男",null,null,null,null,null,null,null,"",{"$f":"IF(R13=\"低学年\",IF($O$3=\"\",\"\",$O$3),IF(R13=\"共通\",IF(#REF!=\"\",\"\",#REF!),\"\"))","v":""},null,"③","参加者数、プロの部数等を入力してください。",null,null,null,"栃木",800,null,0.64167379079807629,"走高跳",800,null,null,0]
[9,null,null,null,"",null,null,0,null,null,"男",null,null,null,null,null,null,null,"",{"$f":"IF(R14=\"低学年\",IF($O$3=\"\",\"\",$O$3),IF(R14=\"共通\",IF(#REF!=\"\",\"\",#REF!),\"\"))","v":""},null,"④","所属、連絡先などを入力してください。",null,null,null,"群馬",4200,null,0.62166420385507348,"走幅跳",801,null,null,0]
[10,null,null,null,"",null,null,0,null,null,"男",null,null,null,null,null,null,null,"",{"$f":"IF(R15=\"低学年\",IF($O$3=\"\",\"\",$O$3),IF(R15=\"共通\",IF(#REF!=\"\",\"\",#REF!),\"\"))","v":""},null,"⑤","「データ転送ボタン」は押さないでください。",null,null,null,"山梨",7100,null,0.22820522038244828,"砲丸投",1000,null,null,0]
[11,null,null,null,"",null,null,0,null,null,"男",null,null,null,null,null,null,null,"",{"$f":"IF(R16=\"低学年\",IF($O$3=\"\",\"\",$O$3),IF(R16=\"共通\",IF(#REF!=\"\",\"\",#REF!),\"\"))","v":""},null,"⑥","必要に応じて男子・女子の一覧表を印刷してください。",null,null,null,"北海道",7300,null,0.1038060432008262,null,3400,null,null,0]
[12,null,null,null,"",null,null,0,null,null,"男",null,null,null,null,null,null,null,"",{"$f":"IF(R17=\"低学年\",IF($O$3=\"\",\"\",$O$3),IF(R17=\"共通\",IF(#REF!=\"\",\"\",#REF!),\"\"))","v":""},null,"⑦","「保存して終了」ボタンを押し保存してください。",null,null,null,"青森",7301,null,0.28189835992449652,null,7100,null,null,0]
[13,null,null,null,"",null,{"$f":"IF($C18=\"\",\"\",VLOOKUP((((INT(($C18-1)/2))*2)+1),学校番号!$A$2:$F$900,6,FALSE))","v":""},0,null,null,"男",null,{"$f":"IF(L18=\"\",\"\",VLOOKUP(L18,$AE$7:$AF$21,2,FALSE))","v":""},null,null,{"$f":"IF(O18=\"\",\"\",VLOOKUP(O18,$AE$7:$AF$21,2,FALSE))","v":""},null,null,"",{"$f":"IF(R18=\"低学年\",IF($O$3=\"\",\"\",$O$3),IF(R18=\"共通\",IF(#REF!=\"\",\"\",#REF!),\"\"))","v":""},null,"⑧","ファイルを指定のアドレスまで送信してください。",null,null,null,"岩手",8500,null,null,null,7200,null,null,0]
[14,null,null,null,"",null,{"$f":"IF($C19=\"\",\"\",VLOOKUP((((INT(($C19-1)/2))*2)+1),学校番号!$A$2:$F$900,6,FALSE))","v":""},0,null,null,"男",null,"",null,null,"",null,null,"",{"$f":"IF(R19=\"低学年\",IF($O$3=\"\",\"\",$O$3),IF(R19=\"共通\",IF(#REF!=\"\",\"\",#REF!),\"\"))","v":""},null,"⑨","印刷した一覧表と参加費を郵送してください。",null,null,null,"秋田",8600.5,null,{"$f":"RAND()","v":0.62103293944800297},null,7300,null,null,0]
[15,null,null,null,"",null,{"$f":"IF($C20=\"\",\"\",VLOOKUP((((INT(($C20-1)/2))*2)+1),学校番号!$A$2:$F$900,6,FALSE))","v":""},0,null,null,"男",null,"",null,null,"",null,null,"",{"$f":"IF(R20=\"低学年\",IF($O$3=\"\",\"\",$O$3),IF(R20=\"共通\",IF(#REF!=\"\",\"\",#REF!),\"\"))","v":""},null,null,null,null,null,null,"宮城",9020.6,null,{"$f":"RAND()","v":0.50686301368213493},null,7301,null,null,0]
[16,null,null,null,"",null,{"$f":"IF($C21=\"\",\"\",VLOOKUP((((INT(($C21-1)/2))*2)+1),学校番号!$A$2:$F$900,6,FALSE))","v":""},0,null,null,"男",null,"",null,null,"",null,null,"",{"$f":"IF(R21=\"低学年\",IF($O$3=\"\",\"\",$O$3),IF(R21=\"共通\",IF(#REF!=\"\",\"\",#REF!),\"\"))","v":""},null,null,null,null,null,null,"山形",9440.7000000000007,null,{"$f":"RAND()","v":0.96126139394677512},null,8300,null,null,0]
[17,null,null,null,"",null,{"$f":"IF($C22=\"\",\"\",VLOOKUP((((INT(($C22-1)/2))*2)+1),学校番号!$A$2:$F$900,6,FALSE))","v":""},0,null,null,"男",null,"",null,null,"",null,null,"",{"$f":"IF(R22=\"低学年\",IF($O$3=\"\",\"\",$O$3),IF(R22=\"共通\",IF(#REF!=\"\",\"\",#REF!),\"\"))","v":""},null,null,null,null,null,null,"福島",9860.7999999999993,null,null,null,null,null,null,0]
[18,null,null,null,"",null,{"$f":"IF($C23=\"\",\"\",VLOOKUP((((INT(($C23-1)/2))*2)+1),学校番号!$A$2:$F$900,6,FALSE))","v":""},0,null,null,"男",null,"",null,null,"",null,null,"",{"$f":"IF(R23=\"低学年\",IF($O$3=\"\",\"\",$O$3),IF(R23=\"共通\",IF(#REF!=\"\",\"\",#REF!),\"\"))","v":""},null,null,null,null,null,null,"長野",10280.9,null,null,null,null,null,null,0]
[19,null,null,null,"",null,{"$f":"IF($C24=\"\",\"\",VLOOKUP((((INT(($C24-1)/2))*2)+1),学校番号!$A$2:$F$900,6,FALSE))","v":""},0,null,null,"男",null,"",null,null,"",null,null,"",{"$f":"IF(R24=\"低学年\",IF($O$3=\"\",\"\",$O$3),IF(R24=\"共通\",IF(#REF!=\"\",\"\",#REF!),\"\"))","v":""},null,null,null,null,null,null,"新潟",10701,null,null,"A",60104,{"$f":"COUNTIF($R$6:$R$35,AE24)","v":0},{"$f":"IF(AG24<4,0,IF(AG24>6,2,1))","v":0},0]
[20,null,null,null,"",null,{"$f":"IF($C25=\"\",\"\",VLOOKUP((((INT(($C25-1)/2))*2)+1),学校番号!$A$2:$F$900,6,FALSE))","v":""},0,null,null,"男",null,"",null,null,"",null,null,"",{"$f":"IF(R25=\"低学年\",IF($O$3=\"\",\"\",$O$3),IF(R25=\"共通\",IF(#REF!=\"\",\"\",#REF!),\"\"))","v":""},null,null,null,null,null,null,"富山",11121.1,null,null,"B",60104,0,0,0]
[21,null,null,null,"",null,{"$f":"IF($C26=\"\",\"\",VLOOKUP((((INT(($C26-1)/2))*2)+1),学校番号!$A$2:$F$900,6,FALSE))","v":""},0,null,null,"男",null,"",null,null,"",null,null,"",{"$f":"IF(R26=\"低学年\",IF($O$3=\"\",\"\",$O$3),IF(R26=\"共通\",IF(#REF!=\"\",\"\",#REF!),\"\"))","v":""},null,null,null,null,null,null,"石川",11541.2,null,null,"C",60104,0,0,0]
[22,null,null,null,"",null,{"$f":"IF($C27=\"\",\"\",VLOOKUP((((INT(($C27-1)/2))*2)+1),学校番号!$A$2:$F$900,6,FALSE))","v":""},0,null,null,"男",null,"",null,null,"",null,null,"",{"$f":"IF(R27=\"低学年\",IF($O$3=\"\",\"\",$O$3),IF(R27=\"共通\",IF(#REF!=\"\",\"\",#REF!),\"\"))","v":""},null,null,null,null,null,null,"福井",11961.3,null,null,null,60104,0,0,0]
[23,null,null,null,"",null,{"$f":"IF($C28=\"\",\"\",VLOOKUP((((INT(($C28-1)/2))*2)+1),学校番号!$A$2:$F$900,6,FALSE))","v":""},0,null,null,"男",null,"",null,null,"",null,null,"",{"$f":"IF(R28=\"低学年\",IF($O$3=\"\",\"\",$O$3),IF(R28=\"共通\",IF(#REF!=\"\",\"\",#REF!),\"\"))","v":""},null,null,null,null,null,null,"静岡",12381.4,null,null,null,60104,0,0,0]
[24,null,null,null,"",null,{"$f":"IF($C29=\"\",\"\",VLOOKUP((((INT(($C29-1)/2))*2)+1),学校番号!$A$2:$F$900,6,FALSE))","v":""},0,null,null,"男",null,"",null,null,"",null,null,"",{"$f":"IF(R29=\"低学年\",IF($O$3=\"\",\"\",$O$3),IF(R29=\"共通\",IF(#REF!=\"\",\"\",#REF!),\"\"))","v":""},null,null,null,null,null,null,"愛知",12801.5,null,null,null,60100,0,0,0]
[25,null,null,null,"",null,{"$f":"IF($C30=\"\",\"\",VLOOKUP((((INT(($C30-1)/2))*2)+1),学校番号!$A$2:$F$900,6,FALSE))","v":""},0,null,null,"男",null,"",null,null,"",null,null,"",{"$f":"IF(R30=\"低学年\",IF($O$3=\"\",\"\",$O$3),IF(R30=\"共通\",IF(#REF!=\"\",\"\",#REF!),\"\"))","v":""},null,null,null,null,null,null,"岐阜",13221.6,null,null,null,60100,0,0,0]
[26,null,null,null,"",null,{"$f":"IF($C31=\"\",\"\",VLOOKUP((((INT(($C31-1)/2))*2)+1),学校番号!$A$2:$F$900,6,FALSE))","v":""},0,null,null,"男",null,"",null,null,"",null,null,"",{"$f":"IF(R31=\"低学年\",IF($O$3=\"\",\"\",$O$3),IF(R31=\"共通\",IF(#REF!=\"\",\"\",#REF!),\"\"))","v":""},null,null,null,null,null,null,"三重",13641.7,null,null,null,60100,0,0,0]
[27,null,null,null,"",null,{"$f":"IF($C32=\"\",\"\",VLOOKUP((((INT(($C32-1)/2))*2)+1),学校番号!$A$2:$F$900,6,FALSE))","v":""},0,null,null,"男",null,"",null,null,"",null,null,"",{"$f":"IF(R32=\"低学年\",IF($O$3=\"\",\"\",$O$3),IF(R32=\"共通\",IF(#REF!=\"\",\"\",#REF!),\"\"))","v":""},null,null,null,null,null,null,"滋賀",14061.8,null,null,null,60100,0,0,0]
[28,null,null,null,"",null,{"$f":"IF($C33=\"\",\"\",VLOOKUP((((INT(($C33-1)/2))*2)+1),学校番号!$A$2:$F$900,6,FALSE))","v":""},0,null,null,"男",null,"",null,null,"",null,null,"",{"$f":"IF(R33=\"低学年\",IF($O$3=\"\",\"\",$O$3),IF(R33=\"共通\",IF(#REF!=\"\",\"\",#REF!),\"\"))","v":""},null,null,null,null,null,null,"京都",14481.9,null,null,null,60100,0,0,0]
[29,null,null,null,"",null,{"$f":"IF($C34=\"\",\"\",VLOOKUP((((INT(($C34-1)/2))*2)+1),学校番号!$A$2:$F$900,6,FALSE))","v":""},0,null,null,"男",null,"",null,null,"",null,null,"",{"$f":"IF(R34=\"低学年\",IF($O$3=\"\",\"\",$O$3),IF(R34=\"共通\",IF(#REF!=\"\",\"\",#REF!),\"\"))","v":""},null,null,null,null,null,null,"大阪",14902,null,null,null,null,null,null,0]
[30,null,null,null,"",null,{"$f":"IF($C35=\"\",\"\",VLOOKUP((((INT(($C35-1)/2))*2)+1),学校番号!$A$2:$F$900,6,FALSE))","v":""},0,null,null,"男",null,"",null,null,"",null,null,"",{"$f":"IF(R35=\"低学年\",IF($O$3=\"\",\"\",$O$3),IF(R35=\"共通\",IF(#REF!=\"\",\"\",#REF!),\"\"))","v":""},null,null,null,null,null,null,"奈良",15322.1,null,null,null,null,null,null,0]
["　　　会　計",null,null,null,null,null,null,null,null,null,null,null,null,null,null,null,null,null,null,null,null,null,null,null,null,null,"和歌山"]
["種　目",null,null,"人数","金　　額",null,null,null,null,null,null,null,null,null,null,null,null,null,null,null,null,null,null,null,null,null,"兵庫",15742.2]
["１種目（１０００円）",null,null,null,{"$f":"D38*1000","v":0},null,null,null,null,null,null,"　所　　属    名 ",null,null,null,null,null,null,null,null,null,null,null,null,null,null,"鳥取",16162.3]
["２種目（１５００円）",null,null,null,{"$f":"D39*1500","v":0},null,null,null,null,null,null,"　代 表 者 氏 名",null,null,null,null,null,null,null,null,null,null,null,null,null,null,"島根",16582.400000000001]
["　ﾘ　ﾚｰ（２０００円）",null,null,null,{"$f":"D40*2000","v":0},null,null,null,null,null,null,"　申し込み責任者　　",null,null,null,null,null,null,null,null,null,null,null,null,null,null,"岡山",17002.5]
{"$rows_left_out":17}
{"sheet":"女子一覧表","index":1,"n_rows":55,"n_cols":34,"rows_kept":55,"cut":false,"hidden":false,"merged":[[45,17,45,19],[44,14,44,16],[41,14,41,19],[41,11,41,13],[42,11,42,13],[42,14,42,17],[41,0,41,2],[0,0,0,17],[38,11,38,13],[37,11,37,13],[3,0,4,0],[1,13,1,16],[39,11,39,13],[3,1,4,1],[36,0,36,2],[37,0,37,2],[40,14,40,19],[3,4,4,4],[38,0,38,2],[39,0,39,2],[40,0,40,2],[3,11,3,17],[39,14,39,17],[40,11,40,13],[37,14,37,19],[38,14,38,17],[3,3,4,3],[3,5,4,5]]}
["第５９回　三鷹市陸上競技選手権大会　兼　第４８回三鷹市陸上競技記録会"]
["（様式１）",null,"記録証希望の方、参加種目、セルの背景を黄色にしてください。",null,null,null,null,null,null,null,null,null,null,"高校　女子　申し込み用"]
[null,null,null,null,null,null,null,null,null,null,null,null,null,null,null,null,"三鷹市陸上競技会"]
["No．","登録　　陸協名","選手","氏　　　名","フリガナ\n（要確認修正）","学年",null,null,null,null,null,"申　込　種　目",null,null,null,null,null,null,null,null,null,null,null,"←押さないでください。"]
[null,null,"番号",null,null,null,"支部コード","所属","学校コード","地域","性","個人種目","種目コード","最高記録","個人種目","種目コード","最高記録","リレー","種目コード"]
[1,null,null,null,{"$f":"PHONETIC(D6)","v":""},null,null,{"$f":"$O$38","v":0},null,null,"女",null,null,null,null,null,null,null,null,null,null,null,null,null,null,null,"都道府県","種目コード",null,"種目","種目コード",null,null,{"$f":"IF(AND(L6=\"\",O6=\"\"),0,1)","v":0}]
[2,null,null,null,{"$f":"PHONETIC(D7)","v":""},null,null,0,null,null,"女",null,null,null,null,null,null,null,null,null,null,"重要","ファイル名を変えずに",null,null,null,"東京",201,{"$f":"RAND()","v":0.37881175650357835},"100m",201,null,null,{"$f":"IF(AND(L7=\"\",O7=\"\"),0,1)","v":0}]
[3,null,null,null,{"$f":"PHONETIC(D8)","v":""},null,null,0,null,null,"女",null,null,null,null,null,null,null,null,null,null,null,"保存してください。",null,null,null,"埼玉",202,0.78100200667744879,"200m",202,null,null,{"$f":"IF(AND(L8=\"\",O8=\"\"),0,1)","v":0}]
[4,null,null,null,"",null,null,0,null,null,"女",null,null,null,null,null,null,null,null,null,null,null,"選手番号は記入しないでください。",null,null,null,"神奈川",203,0.73778987348485747,"1500m",203,null,null,{"$f":"IF(AND(L10=\"\",O10=\"\"),0,1)","v":0}]
[5,null,null,null,"",null,null,0,null,null,"女",null,null,null,null,null,null,null,null,null,null,"手順",null,null,null,null,"千葉",300,0.29556030209422113,"3000m",300,null,null,0]
[6,null,null,null,"",null,null,0,null,null,"女",null,null,null,null,null,null,null,null,null,null,"①","選手のデータを入力してください。",null,null,null,"茨城",600,0.81846610800101938,"走高跳",600,null,null,0]
[7,null,null,null,"",null,null,0,null,null,"女",null,null,null,null,null,null,null,null,null,null,"②","リレーのデータを入力してください。",null,null,null,"栃木",800,0.54824544600660741,"走幅跳",800,null,null,0]
[8,null,null,null,"",null,null,0,null,null,"女",null,null,null,null,null,null,null,null,null,null,"③","参加者数、プロの部数等を入力してください。",null,null,null,"群馬",4200,0.65767350066870911,"砲丸投",4200,null,null,0]
[9,null,null,null,"",null,null,0,null,null,"女",null,null,null,null,null,null,null,null,null,null,"④","所属、連絡先などを入力してください。",null,null,null,"山梨",7100,0.70343051276730573,null,7100,null,null,0]
[10,null,null,null,"",null,null,0,null,null,"女",null,null,null,null,null,null,null,null,null,null,"⑤","「データ転送ボタン」は押さないでください。",null,null,null,"北海道",7300,0.2235719554595712,null,7300,null,null,0]
[11,null,null,null,"",null,null,0,null,null,"女",null,null,null,null,null,null,null,null,null,null,"⑥","必要に応じて男子・女子の一覧表を印刷してください。",null,null,null,"青森",7301,0.3919565679795507,null,7301,null,null,0]
[12,null,null,null,"",null,null,0,null,null,"女",null,null,null,null,null,null,null,null,null,null,"⑦","「保存して終了」ボタンを押し保存してください。",null,null,null,"岩手",8500,0.62595110033449852,null,8500,null,null,0]
[13,null,null,null,"",null,null,0,null,null,"女",null,7100,null,null,"",null,null,{"$f":"IF(R18=\"\",\"\",VLOOKUP(R18,$AD$24:$AE$25,2,FALSE))","v":""},{"$f":"IF(R18=\"低学年\",IF($O$3=\"\",\"\",$O$3),IF(R18=\"共通\",IF(#REF!=\"\",\"\",#REF!),\"\"))","v":""},null,"⑧","ファイルを指定のアドレスまで送信してください。",null,null,null,"秋田",8600.5]
[14,null,null,null,"",null,null,0,null,null,"女",null,7100,null,null,"",null,null,"",{"$f":"IF(R19=\"低学年\",IF($O$3=\"\",\"\",$O$3),IF(R19=\"共通\",IF(#REF!=\"\",\"\",#REF!),\"\"))","v":""},null,"⑨","印刷した一覧表と参加費を郵送してください。",null,null,null,"宮城",9020.6,null,null,null,null,null,{"$f":"IF(AND(L19=\"\",O19=\"\"),0,1)","v":0}]
[15,null,null,null,"",null,null,0,null,null,"女",null,7300,null,null,"",null,null,"",{"$f":"IF(R20=\"低学年\",IF($O$3=\"\",\"\",$O$3),IF(R20=\"共通\",IF(#REF!=\"\",\"\",#REF!),\"\"))","v":""},null,null,null,null,null,null,"山形",9440.7000000000007,null,null,null,null,null,0]
[16,null,null,null,"",null,null,0,null,null,"女",null,{"$f":"IF(L21=\"\",\"\",VLOOKUP(L21,$AD$7:$AE$22,2,FALSE))","v":""},null,null,{"$f":"IF(O21=\"\",\"\",VLOOKUP(O21,$AD$7:$AE$22,2,FALSE))","v":""},null,null,"",{"$f":"IF(R21=\"低学年\",IF($O$3=\"\",\"\",$O$3),IF(R21=\"共通\",IF(#REF!=\"\",\"\",#REF!),\"\"))","v":""},null,null,null,null,null,null,"福島",9860.7999999999993,null,null,null,null,null,0]
[17,null,null,null,"",null,null,0,null,null,"女",null,"",null,null,"",null,null,"",{"$f":"IF(R22=\"低学年\",IF($O$3=\"\",\"\",$O$3),IF(R22=\"共通\",IF(#REF!=\"\",\"\",#REF!),\"\"))","v":""},null,null,null,null,null,null,"長野",10280.9,null,null,null,null,null,0]
[18,null,null,null,"",null,null,0,null,null,"女",null,"",null,null,"",null,null,"",{"$f":"IF(R23=\"低学年\",IF($O$3=\"\",\"\",$O$3),IF(R23=\"共通\",IF(#REF!=\"\",\"\",#REF!),\"\"))","v":""},null,null,null,null,null,null,"新潟",10701,null,null,null,null,null,0]
[19,null,null,null,"",null,null,0,null,null,"女",null,"",null,null,"",null,null,"",{"$f":"IF(R24=\"低学年\",IF($O$3=\"\",\"\",$O$3),IF(R24=\"共通\",IF(#REF!=\"\",\"\",#REF!),\"\"))","v":""},null,null,null,null,null,null,"富山",11121.1,null,"A",60104,{"$f":"COUNTIF($R$6:$R$35,#REF!)","v":0},{"$f":"IF(AF24<4,0,IF(AF24>6,2,1))","v":0},0]
[20,null,null,null,"",null,null,0,null,null,"女",null,"",null,null,"",null,null,"",{"$f":"IF(R25=\"低学年\",IF($O$3=\"\",\"\",$O$3),IF(R25=\"共通\",IF(#REF!=\"\",\"\",#REF!),\"\"))","v":""},null,null,null,null,null,null,"石川",11541.2,null,"B",60104,{"$f":"COUNTIF($R$6:$R$35,#REF!)","v":0},0,0]
[21,null,null,null,"",null,null,0,null,null,"女",null,"",null,null,"",null,null,"",{"$f":"IF(R26=\"低学年\",IF($O$3=\"\",\"\",$O$3),IF(R26=\"共通\",IF(#REF!=\"\",\"\",#REF!),\"\"))","v":""},null,null,null,null,null,null,"福井",11961.3,null,"C",60104,{"$f":"COUNTIF($R$6:$R$35,#REF!)","v":0},0,0]
[22,null,null,null,"",null,null,0,null,null,"女",null,"",null,null,"",null,null,"",{"$f":"IF(R27=\"低学年\",IF($O$3=\"\",\"\",$O$3),IF(R27=\"共通\",IF(#REF!=\"\",\"\",#REF!),\"\"))","v":""},null,null,null,null,null,null,"静岡",12381.4,null,null,60104,{"$f":"COUNTIF($R$6:$R$35,AD27)","v":0},0,0]
[23,null,null,null,"",null,null,0,null,null,"女",null,"",null,null,"",null,null,"",{"$f":"IF(R28=\"低学年\",IF($O$3=\"\",\"\",$O$3),IF(R28=\"共通\",IF(#REF!=\"\",\"\",#REF!),\"\"))","v":""},null,null,null,null,null,null,"愛知",12801.5,null,null,60104,0,0,0]
[24,null,null,null,"",null,null,0,null,null,"女",null,"",null,null,"",null,null,"",{"$f":"IF(R29=\"低学年\",IF($O$3=\"\",\"\",$O$3),IF(R29=\"共通\",IF(#REF!=\"\",\"\",#REF!),\"\"))","v":""},null,null,null,null,null,null,"岐阜",13221.6,null,null,60100,0,0,0]
[25,null,null,null,"",null,null,0,null,null,"女",null,"",null,null,"",null,null,"",{"$f":"IF(R30=\"低学年\",IF($O$3=\"\",\"\",$O$3),IF(R30=\"共通\",IF(#REF!=\"\",\"\",#REF!),\"\"))","v":""},null,null,null,null,null,null,"三重",13641.7,null,null,60100,0,0,0]
[26,null,null,null,"",null,null,0,null,null,"女",null,"",null,null,"",null,null,"",{"$f":"IF(R31=\"低学年\",IF($O$3=\"\",\"\",$O$3),IF(R31=\"共通\",IF(#REF!=\"\",\"\",#REF!),\"\"))","v":""},null,null,null,null,null,null,"滋賀",14061.8,null,null,60100,0,0,0]
[27,null,null,null,"",null,null,0,null,null,"女",null,"",null,null,"",null,null,"",{"$f":"IF(R32=\"低学年\",IF($O$3=\"\",\"\",$O$3),IF(R32=\"共通\",IF(#REF!=\"\",\"\",#REF!),\"\"))","v":""},null,null,null,null,null,null,"京都",14481.9,null,null,60100,0,0,0]
[28,null,null,null,"",null,null,0,null,null,"女",null,"",null,null,"",null,null,"",{"$f":"IF(R33=\"低学年\",IF($O$3=\"\",\"\",$O$3),IF(R33=\"共通\",IF(#REF!=\"\",\"\",#REF!),\"\"))","v":""},null,null,null,null,null,null,"大阪",14902,null,null,60100,0,0,0]
[29,null,null,null,"",null,null,0,null,null,"女",null,"",null,null,"",null,null,"",{"$f":"IF(R34=\"低学年\",IF($O$3=\"\",\"\",$O$3),IF(R34=\"共通\",IF(#REF!=\"\",\"\",#REF!),\"\"))","v":""},null,null,null,null,null,null,"奈良",15322.1,null,null,null,null,null,0]
[30,null,null,null,"",null,null,0,null,null,"女",null,"",null,null,"",null,null,"",{"$f":"IF(R35=\"低学年\",IF($O$3=\"\",\"\",$O$3),IF(R35=\"共通\",IF(#REF!=\"\",\"\",#REF!),\"\"))","v":""},null,null,null,null,null,null,"和歌山",15742.2,null,null,null,null,null,0]
["　　　会　計",null,null,null,null,null,null,null,null,null,null,null,null,null,null,null,null,null,null,null,null,null,null,null,null,null,"兵庫"]
["種　目",null,null,"人数","金　　額",null,null,null,null,null,null,null,null,null,null,null,null,null,null,null,null,null,null,null,null,null,"鳥取",16162.3]
["１種目（１０００円）",null,null,null,{"$f":"D38*1000","v":0},null,null,null,null,null,null,"　所　　属    名 ",null,null,null,null,null,null,null,null,null,null,null,null,null,null,"島根",16582.400000000001]
["２種目（１５００円）",null,null,null,{"$f":"D39*1500","v":0},null,null,null,null,null,null,"　代 表 者 氏 名",null,null,null,null,null,null,null,null,null,null,null,null,null,null,"岡山",17002.5]
["　ﾘ　ﾚｰ（２０００円）",null,null,null,{"$f":"D40*2000","v":0},null,null,null,null,null,null,"　申し込み責任者　　",null,null,null,null,null,null,null,null,null,null,null,null,null,null,"広島",17422.599999999999]
{"$rows_left_out":16}
{"sheet":"貼り付けデータ","index":2,"n_rows":390,"n_cols":21,"rows_kept":390,"cut":false,"hidden":false,"merged":[]}
["チェック","陸連番号","番号","氏名","フリガナ","年","支部コード","所属","学校コード","地域","性","種目","種目コード","記録",null,"Ｎｏ．","顧問","帯同審判","所属",{"$f":"IF(COUNTIF(A2:A100,\"エラー\")>0,\"どこかに重複データがあります。A列の「エラー」をご確認の上、一覧表を訂正して下さい。\",\"\")","v":""},"間違えはありません。一覧表を印刷してください。"]
[{"$f":"IF(C2=\"\",\"\",IF(L2=\"1年\",\"\",IF(L2=\"2年\",\"\",IF(L2=\"低学年\",\"\",IF(L2=\"共通\",\"\",IF(AND(K2=K1,L2=L1,C2=C1),\"エラー\",\"\"))))))","v":""}]
[""]
[""]
[""]
[""]
[""]
[""]
[""]
[""]
[""]
[""]
[""]
[""]
[""]
[""]
[""]
[""]
[""]
[""]
[""]
[""]
[""]
[""]
[""]
[""]
[""]
[""]
[""]
[""]
[""]
[""]
[""]
[{"$f":"IF(C34=\"\",\"\",IF(L34=\"1年\",\"\",IF(L34=\"2年\",\"\",IF(L34=\"低学年\",\"\",IF(L34=\"共通\",\"\",IF(AND(K34=K33,L34=L33,C34=C33),\"エラー\",\"\"))))))","v":""}]
[""]
[""]
[""]
[""]
[""]
[""]
{"$rows_left_out":351}
{"sheet":"貼り付けデータ２","index":3,"n_rows":1,"n_cols":26,"rows_kept":1,"cut":false,"hidden":false,"merged":[]}
[null,"陸連番号","番号","氏　　　名","年","支部","支部コード","所属","学校コード","地域","性","個人種目１","種目コード","最高記録","個人種目２","種目コード","最高記録","リレー","種目コード","最高記録","フリガナ",null,"Ｎｏ．","顧問","帯同審判","所属"]

{"sheet":"学校番号","index":4,"n_rows":1,"n_cols":6,"rows_kept":1,"cut":false,"hidden":false,"merged":[]}
["学校番号","支部","所属","地域","学校コード","支部番号"]

{"sheet":"互換性レポート","index":5,"n_rows":13,"n_cols":6,"rows_kept":13,"cut":false,"hidden":false,"merged":[]}
[null,"（修正）高校申し込み用紙.xls の互換性レポート"]
[null,"2015/7/6 20:25 に実行"]
[]
[null,"このブックで使用されている次の機能は、以前のバージョンの Excel ではサポートされていません。このブックを以前のバージョンの Excel で開くか、以前のファイル形式で保存すると、それらの機能が失われるか、正常に実行されなくなる可能性があります。"]
[]
[null,"機能の大幅な損失",null,null,"出現数","バージョン"]
[]
[null,"このブック内の一部のセルには、他のワークシートの値を参照するデータ入力規則が設定されています。このようなデータ入力規則は保存されません。",null,null,5]
[null,null,null,null,"女子一覧表'!L6:L36","Excel 97-2003"]
[null,null,null,null,"女子一覧表'!O6:O36"]
[null,null,null,null,"女子一覧表'!R6:R36"]
[null,null,null,null,"女子一覧表'!B6:B35"]
[null,null,null,null,"女子一覧表'!AD31"]